You are not logged in.

#1 01-02-2014 23:40:48

boenki
Membre
Registered: 09-21-2011
Posts: 78

compile error

Hi,

someone has reported this error in the AUR:
https://aur.archlinux.org/packages/ffdiaporama-devel/

I got this error on x86_64:

[...]
/usr/bin/ld: /usr/lib/gcc/x86_64-unknown-linux-gnu/4.8.2/../../../../lib/libavcodec.a(lclenc.o): undefined reference to symbol 'deflateReset'
/usr/lib/libz.so.1: error adding symbols: DSO missing from command line
collect2: Fehler: ld gab 1 als Ende-Status zurück
Makefile:456: recipe for target 'ffDiaporama' failed
make[1]: *** [ffDiaporama] Error 1
make[1]: Leaving directory '/home/matze/paketierung/ffdiaporama-devel/src/src/ffDiaporama'
Makefile:38: recipe for target 'sub-src-ffDiaporama-make_first' failed
make: *** [sub-src-ffDiaporama-make_first] Error 2
==> FEHLER: Ein Fehler geschah in build().
Breche ab ...

I tried to reproduce on my i686 PC but here it compiles fine ...

Offline

#2 01-03-2014 11:55:50

domledom
Administrateur
Registered: 09-17-2011
Posts: 1,080

Re: compile error

Hi Steffen

Did you know which ffmpeg or libav version is ?


Processeur i5 - 8 Go RAM - Manjaro Linux KDE (64 bits) / Windows 7 (64 bits)

Offline

#3 01-03-2014 22:54:29

boenki
Membre
Registered: 09-21-2011
Posts: 78

Re: compile error

solved! smile

I asked

are you using the latest ffmpeg from the repos?

The user wrote back

That was the mistake! For some reason I had aur / ffmpeg-full-git instead of extra / ffmpeg installed. Now it works! Many many thanks for the help!

Offline

Board footer